Target
Dopamine beta-hydroxylase
Ligand
BDBM50025807
Substrate
Meas. Tech.
ChEMBL_59302 (CHEMBL669437)
IC50
52480.75±n/a nM
Citation
 Hahn, MRogers, D Receptor surface models. 2. Application to quantitative structure-activity relationships studies. J Med Chem 38:2091-102 (1995)  
Target
Name:
Dopamine beta-hydroxylase
Synonyms:
DBH Dopamine beta-monooxygenase | Soluble dopamine beta-hydroxylase
Type:
PROTEIN
Mol. Mass.:
69062.68
Organism:
Homo sapiens (Human)
Description:
ChEMBL_59428
Residue:
617
  
Inhibitor
Name:
BDBM50025807
Synonyms:
1-(4-Nitro-benzyl)-1,3-dihydro-imidazole-2-thione | CHEMBL293230
Type:
Small organic molecule
Emp. Form.:
C10H9N3O2S
Mol. Mass.:
235.262
SMILES:
[O-][N+](=O)c1ccc(Cn2cc[nH]c2=S)cc1
: