Target
Protein Tat
Ligand
BDBM50407479
Substrate
Meas. Tech.
ChEMBL_199318 (CHEMBL805260)
IC50
4500±n/a nM
Citation
 Michne, WFSchroeder, JDBailey, TRNeumann, HCCooke, DYoung, DCHughes, JVKingsley, SDRyan, KAPutz, HS Keto/enol epoxy steroids as HIV-1 Tat inhibitors: structure-activity relationships and pharmacophore localization. J Med Chem 38:3197-206 (1995)  
Target
Name:
Protein Tat
Synonyms:
Human immunodeficiency virus type 1 Tat protein TAT_HV112 tat
Type:
PROTEIN
Mol. Mass.:
9771.75
Organism:
Human immunodeficiency virus type 1 (isolate PCV12 group M subtype B)(HIV-1)
Description:
ChEMBL_199318
Residue:
86
  
Inhibitor
Name:
BDBM50407479
Synonyms:
CHEMBL323490
Type:
Small organic molecule
Emp. Form.:
C15H17NO3
Mol. Mass.:
259.3004
SMILES:
CC1(C)CC(C(=O)Nc2ccccc2)C(=O)C2OC12
: