Target
Dihydrofolate reductase
Ligand
BDBM50291785
Substrate
Meas. Tech.
ChEMBL_53000 (CHEMBL858265)
Ki
19.5±n/a nM
Citation
 Marlowe, CKSelassie, CDSanti, DV Quantitative structure-activity relationships of the inhibition of Pneumocystis carinii dihydrofolate reductase by 4,6-diamino-1,2-dihydro-2,2-dimethyl-1-(X-phenyl)-s-triazines. J Med Chem 38:967-72 (1995)  
Target
Name:
Dihydrofolate reductase
Synonyms:
DYR_PNECA Dihydrofolate reductase Tetrahydrofolate dehydrogenase
Type:
Enzyme
Mol. Mass.:
23891.29
Organism:
Pneumocystis carinii
Description:
Residue:
206
  
Inhibitor
Name:
BDBM50291785
Synonyms:
6,6-Dimethyl-1-(3-m-tolyloxymethyl-phenyl)-1,6-dihydro-[1,3,5]triazine-2,4-diamine | CHEMBL20480
Type:
Small organic molecule
Emp. Form.:
C19H23N5O
Mol. Mass.:
337.4188
SMILES:
Cc1cccc(OCc2cccc(c2)N2C(N)=NC(N)=NC2(C)C)c1
: