Target
5-hydroxytryptamine receptor 1D
Ligand
BDBM81497
Substrate
Meas. Tech.
ChEMBL_1953 (CHEMBL617560)
IC50
123.03±n/a nM
Citation
 Rault, SLancelot, JCPrunier, HRobba, MRenard, PDelagrange, PPfeiffer, BCaignard, DHGuardiola-Lemaitre, BHamon, M Novel selective and partial agonists of 5-HT3 receptors. Part 1. Synthesis and biological evaluation of piperazinopyrrolothienopyrazines. J Med Chem 39:2068-80 (1996)  
Target
Name:
5-hydroxytryptamine receptor 1D
Synonyms:
5HT1D_PIG Serotonin 1d (5-HT1d) receptor
Type:
PROTEIN
Mol. Mass.:
32680.56
Organism:
Sus scrofa
Description:
ChEMBL_1963
Residue:
291
  
Inhibitor
Name:
BDBM81497
Synonyms:
4-(4-Methyl-piperazin-1-yl)-7-trifluoromethyl-pyrrolo[1,2-a]quinoxaline CGS 12066B NSC_123945
Type:
Small organic molecule
Emp. Form.:
C17H17F3N4
Mol. Mass.:
334.3389
SMILES:
CN1CCN(CC1)c1nc2cc(ccc2n2cccc12)C(F)(F)F
: