Target
5-hydroxytryptamine receptor 2C
Ligand
BDBM50060417
Substrate
Meas. Tech.
ChEMBL_2774 (CHEMBL858023)
Ki
10±n/a nM
Citation
 Audia, JEEvrard, DAMurdoch, GRDroste, JJNissen, JSSchenck, KWFludzinski, PLucaites, VLNelson, DLCohen, ML Potent, selective tetrahydro-beta-carboline antagonists of the serotonin 2B (5HT2B) contractile receptor in the rat stomach fundus. J Med Chem 39:2773-80 (1996)  
Target
Name:
5-hydroxytryptamine receptor 2C
Synonyms:
5-HT2C 5-hydroxytryptamine receptor 2C (5HT2C) 5ht1c Htr1c Serotonin 2c (5-HT2c) receptor
Type:
Enzyme
Mol. Mass.:
51948.16
Organism:
Mus musculus (Mouse)
Description:
P34968
Residue:
459
  
Inhibitor
Name:
BDBM50060417
Synonyms:
5-Methyl-3,5-dihydro-2H-pyrrolo[2,3-f]indole-1-carboxylic acid pyridin-3-ylamide SB 206553 | SB-206553
Type:
Small organic molecule
Emp. Form.:
C17H16N4O
Mol. Mass.:
292.3351
SMILES:
Cn1ccc2cc3N(CCc3cc12)C(=O)Nc1cccnc1
: