Target
Acetylcholinesterase
Ligand
BDBM50407951
Substrate
Meas. Tech.
ChEMBL_28928 (CHEMBL857056)
IC50
23988.33±n/a nM
Citation
 Tong, WCollantes, ERChen, YWelsh, WJ A comparative molecular field analysis study of N-benzylpiperidines as acetylcholinesterase inhibitors. J Med Chem 39:380-7 (1996)  
Target
Name:
Acetylcholinesterase
Synonyms:
ACES_MOUSE Acetylcholinesterase (mouse AChE) Ache
Type:
Enzyme
Mol. Mass.:
68165.65
Organism:
Mus musculus (mouse)
Description:
Residue:
614
  
Inhibitor
Name:
BDBM50407951
Synonyms:
CHEMBL339484
Type:
Small organic molecule
Emp. Form.:
C26H38N2O
Mol. Mass.:
394.5927
SMILES:
CN(CCC1CCN(CC23CC4CC(CC(C4)C2)C3)CC1)C(=O)c1ccccc1
: