Target
Acetylcholinesterase
Ligand
BDBM50004020
Substrate
Meas. Tech.
ChEMBL_28928 (CHEMBL857056)
IC50
29.99±n/a nM
Citation
 Tong, WCollantes, ERChen, YWelsh, WJ A comparative molecular field analysis study of N-benzylpiperidines as acetylcholinesterase inhibitors. J Med Chem 39:380-7 (1996)  
Target
Name:
Acetylcholinesterase
Synonyms:
ACES_MOUSE Acetylcholinesterase (mouse AChE) Ache
Type:
Enzyme
Mol. Mass.:
68165.65
Organism:
Mus musculus (mouse)
Description:
Residue:
614
  
Inhibitor
Name:
BDBM50004020
Synonyms:
2-(2-(1-benzylpiperidin-4-yl)ethyl)isoindoline-1,3-dione CHEMBL106891 | CHEMBL541625
Type:
Small organic molecule
Emp. Form.:
C22H24N2O2
Mol. Mass.:
348.4382
SMILES:
O=C1N(CCC2CCN(Cc3ccccc3)CC2)C(=O)c2ccccc12
: