Target
5-hydroxytryptamine receptor 2C
Ligand
BDBM50407994
Substrate
Meas. Tech.
ChEMBL_2854 (CHEMBL617495)
Ki
39.81±n/a nM
Citation
 Forbes, ITDabbs, SDuckworth, DMHam, PJones, GEKing, FDSaunders, DVBlaney, FENaylor, CBBaxter, GSBlackburn, TPKennett, GAWood, MD Synthesis, biological activity, and molecular modeling of selective 5-HT(2C/2B) receptor antagonists. J Med Chem 39:4966-77 (1997)  
Target
Name:
5-hydroxytryptamine receptor 2C
Synonyms:
5-HT2C 5-hydroxytryptamine receptor 2C (5HT2c) 5ht1c Htr2c Serotonin receptor 2a and 2c (5HT2A and 5HT2C)
Type:
Enzyme
Mol. Mass.:
51935.10
Organism:
Rattus norvegicus (Rat)
Description:
P08909
Residue:
460
  
Inhibitor
Name:
BDBM50407994
Synonyms:
CHEMBL343455
Type:
Small organic molecule
Emp. Form.:
C18H18N4O
Mol. Mass.:
306.3617
SMILES:
Cc1cc2cc3N(CCc3cc2n1C)C(=O)Nc1cccnc1
: