Target
5-hydroxytryptamine receptor 1A
Ligand
BDBM81497
Substrate
Meas. Tech.
ChEMBL_559 (CHEMBL615579)
IC50
46.77±n/a nM
Citation
 Prunier, HRault, SLancelot, JCRobba, MRenard, PDelagrange, PPfeiffer, BCaignard, DHMisslin, RGuardiola-Lemaitre, BHamon, M Novel and selective partial agonists of 5-HT3 receptors. 2. Synthesis and biological evaluation of piperazinopyridopyrrolopyrazines, piperazinopyrroloquinoxalines, and piperazinopyridopyrroloquinoxalines. J Med Chem 40:1808-19 (1997)  
Target
Name:
5-hydroxytryptamine receptor 1A
Synonyms:
5-HT-1A 5-hydroxytryptamine receptor 1A (5-HT-1A) ADRB2RL1 Dopamine D2 receptor and serotonin 1a receptor HTR1A | Serotonin receptor 1A
Type:
Mol. Mass.:
46122.49
Organism:
Homo sapiens (Human)
Description:
Residue:
422
  
Inhibitor
Name:
BDBM81497
Synonyms:
4-(4-Methyl-piperazin-1-yl)-7-trifluoromethyl-pyrrolo[1,2-a]quinoxaline CGS 12066B NSC_123945
Type:
Small organic molecule
Emp. Form.:
C17H17F3N4
Mol. Mass.:
334.3389
SMILES:
CN1CCN(CC1)c1nc2cc(ccc2n2cccc12)C(F)(F)F
: