Target
D(2) dopamine receptor
Ligand
BDBM50408241
Substrate
Meas. Tech.
ChEMBL_61316 (CHEMBL670091)
Ki
7300±n/a nM
Citation
 Elworthy, TRFord, APBantle, GWMorgans, DJOzer, RSPalmer, WSRepke, DBRomero, MSandoval, LSjogren, EBTalamás, FXVazquez, AWu, HArredondo, NFBlue, DRDeSousa, AGross, LMKava, MSLesnick, JDVimont, RLWilliams, TJZhu, QMPfister, JRClarke, DE N-arylpiperazinyl-N'-propylamino derivatives of heteroaryl amides as functional uroselective alpha 1-adrenoceptor antagonists. J Med Chem 40:2674-87 (1997)  
Target
Name:
D(2) dopamine receptor
Synonyms:
D(2) dopamine receptor DOPAMINE D2 Long DRD2 Dopamine D2 receptor Dopamine D2 receptor (D2R) Dopamine2-like | d2
Type:
Cell-surface receptors
Mol. Mass.:
50647.10
Organism:
Homo sapiens (Human)
Description:
P14416
Residue:
443
  
Inhibitor
Name:
BDBM50408241
Synonyms:
CHEMBL89030
Type:
Small organic molecule
Emp. Form.:
C24H34N4O2
Mol. Mass.:
410.5524
SMILES:
COc1ccccc1N1CCN(CCCNc2cc(C)ccc2C(=O)N(C)C)CC1
: