Target
Alpha-1A adrenergic receptor
Ligand
BDBM50408232
Substrate
Meas. Tech.
ChEMBL_33595 (CHEMBL652804)
Ki
0.794328±n/a nM
Citation
 Elworthy, TRFord, APBantle, GWMorgans, DJOzer, RSPalmer, WSRepke, DBRomero, MSandoval, LSjogren, EBTalamás, FXVazquez, AWu, HArredondo, NFBlue, DRDeSousa, AGross, LMKava, MSLesnick, JDVimont, RLWilliams, TJZhu, QMPfister, JRClarke, DE N-arylpiperazinyl-N'-propylamino derivatives of heteroaryl amides as functional uroselective alpha 1-adrenoceptor antagonists. J Med Chem 40:2674-87 (1997)  
Target
Name:
Alpha-1A adrenergic receptor
Synonyms:
ADA1A_BOVIN ADRA1C Alpha 1A-adrenoreceptor Cerebral cortex alpha adrenergic receptor | adrenergic Alpha1
Type:
Enzyme Catalytic Domain
Mol. Mass.:
51492.08
Organism:
CALF
Description:
adrenergic Alpha1 0 CALF
Residue:
466
  
Inhibitor
Name:
BDBM50408232
Synonyms:
CHEMBL91093
Type:
Small organic molecule
Emp. Form.:
C26H39N5O2
Mol. Mass.:
453.6202
SMILES:
CN(C)C(=O)c1cccnc1NCCCN1CCN(CC1)c1ccccc1OCC(C)(C)C
: