Target
Aryl hydrocarbon receptor
Ligand
BDBM50408300
Substrate
Meas. Tech.
ChEMBL_36196 (CHEMBL649365)
EC50
16.98±n/a nM
Citation
 So, SSKarplus, M Three-dimensional quantitative structure-activity relationships from molecular similarity matrices and genetic neural networks. 2. Applications. J Med Chem 40:4360-71 (1998)  
Target
Name:
Aryl hydrocarbon receptor
Synonyms:
AHR BHLHE76 aryl hydrocarbon receptor precursor
Type:
PROTEIN
Mol. Mass.:
96143.77
Organism:
Homo sapiens (Human)
Description:
ChEMBL_1503828
Residue:
848
  
Inhibitor
Name:
BDBM50408300
Synonyms:
CHEMBL422101
Type:
Small organic molecule
Emp. Form.:
C12H3Br5O2
Mol. Mass.:
578.671
SMILES:
Brc1cc2Oc3c(Br)cc(Br)c(Br)c3Oc2cc1Br
: