Target
Aryl hydrocarbon receptor
Ligand
BDBM50408302
Substrate
Meas. Tech.
ChEMBL_36196 (CHEMBL649365)
EC50
46.77±n/a nM
Citation
 So, SSKarplus, M Three-dimensional quantitative structure-activity relationships from molecular similarity matrices and genetic neural networks. 2. Applications. J Med Chem 40:4360-71 (1998)  
Target
Name:
Aryl hydrocarbon receptor
Synonyms:
AHR BHLHE76 aryl hydrocarbon receptor precursor
Type:
PROTEIN
Mol. Mass.:
96143.77
Organism:
Homo sapiens (Human)
Description:
ChEMBL_1503828
Residue:
848
  
Inhibitor
Name:
BDBM50408302
Synonyms:
CHEMBL343049
Type:
Small organic molecule
Emp. Form.:
C12H2Cl6O
Mol. Mass.:
374.862
SMILES:
Clc1cc2c(oc3c(Cl)c(Cl)c(Cl)cc23)c(Cl)c1Cl
: