Target
Dopamine beta-hydroxylase
Ligand
BDBM50025808
Substrate
Meas. Tech.
ChEMBL_59428 (CHEMBL671831)
IC50
61659.5±n/a nM
Citation
 So, SSKarplus, M Three-dimensional quantitative structure-activity relationships from molecular similarity matrices and genetic neural networks. 2. Applications. J Med Chem 40:4360-71 (1998)  
Target
Name:
Dopamine beta-hydroxylase
Synonyms:
DBH Dopamine beta-monooxygenase | Soluble dopamine beta-hydroxylase
Type:
PROTEIN
Mol. Mass.:
69062.68
Organism:
Homo sapiens (Human)
Description:
ChEMBL_59428
Residue:
617
  
Inhibitor
Name:
BDBM50025808
Synonyms:
1-(2,3,5,6-Tetrafluoro-4-hydroxy-benzyl)-1,3-dihydro-imidazole-2-thione | CHEMBL63145
Type:
Small organic molecule
Emp. Form.:
C10H6F4N2OS
Mol. Mass.:
278.226
SMILES:
Oc1c(F)c(F)c(Cn2cc[nH]c2=S)c(F)c1F
: