Target
Substance-P receptor
Ligand
BDBM50052283
Substrate
Meas. Tech.
ChEMBL_205893 (CHEMBL813805)
IC50
1.29±n/a nM
Citation
 Takeuchi, YShands, EFBeusen, DDMarshall, GR Derivation of a three-dimensional pharmacophore model of substance P antagonists bound to the neurokinin-1 receptor. J Med Chem 41:3609-23 (1998)  
Target
Name:
Substance-P receptor
Synonyms:
NK-1 receptor NK1 Receptor NK1R_HUMAN Neurokinin-1 (NK-1) SPR TACR1 Tachykinin receptor 1 (NK1) | tachykinin
Type:
G Protein-Coupled Receptor (GPCR)
Mol. Mass.:
46254.43
Organism:
Homo sapiens (Human)
Description:
P25103
Residue:
407
  
Inhibitor
Name:
BDBM50052283
Synonyms:
2-[(2S,3S)-3-(3,5-Bis-trifluoromethyl-benzyloxy)-2-phenyl-piperidin-1-yl]-acetamide CHEMBL27003 | L-736281
Type:
Small organic molecule
Emp. Form.:
C22H22F6N2O2
Mol. Mass.:
460.4127
SMILES:
NC(=O)CN1CCC[C@H](OCc2cc(cc(c2)C(F)(F)F)C(F)(F)F)[C@@H]1c1ccccc1
: