Target
Substance-P receptor
Ligand
BDBM50408455
Substrate
Meas. Tech.
ChEMBL_205894 (CHEMBL813806)
IC50
0.363±n/a nM
Citation
 Takeuchi, YShands, EFBeusen, DDMarshall, GR Derivation of a three-dimensional pharmacophore model of substance P antagonists bound to the neurokinin-1 receptor. J Med Chem 41:3609-23 (1998)  
Target
Name:
Substance-P receptor
Synonyms:
NK-1 receptor NK1 Receptor NK1R_HUMAN Neurokinin-1 (NK-1) SPR TACR1 Tachykinin receptor 1 (NK1) | tachykinin
Type:
G Protein-Coupled Receptor (GPCR)
Mol. Mass.:
46254.43
Organism:
Homo sapiens (Human)
Description:
P25103
Residue:
407
  
Inhibitor
Name:
BDBM50408455
Synonyms:
CHEMBL120523
Type:
Small organic molecule
Emp. Form.:
C21H26N2O
Mol. Mass.:
322.4439
SMILES:
COc1ccccc1CN1CCN2CCC[C@H]1[C@@H]2c1ccccc1
: