Target
Substance-P receptor
Ligand
BDBM50408464
Substrate
Meas. Tech.
ChEMBL_205893 (CHEMBL813805)
IC50
2344.23±n/a nM
Citation
 Takeuchi, YShands, EFBeusen, DDMarshall, GR Derivation of a three-dimensional pharmacophore model of substance P antagonists bound to the neurokinin-1 receptor. J Med Chem 41:3609-23 (1998)  
Target
Name:
Substance-P receptor
Synonyms:
NK-1 receptor NK1 Receptor NK1R_HUMAN Neurokinin-1 (NK-1) SPR TACR1 Tachykinin receptor 1 (NK1) | tachykinin
Type:
G Protein-Coupled Receptor (GPCR)
Mol. Mass.:
46254.43
Organism:
Homo sapiens (Human)
Description:
P25103
Residue:
407
  
Inhibitor
Name:
BDBM50408464
Synonyms:
CHEMBL332843
Type:
Small organic molecule
Emp. Form.:
C20H24N2O
Mol. Mass.:
308.4174
SMILES:
Cc1cc(C)cc(COC[C@@H](N)Cc2c[nH]c3ccccc23)c1
: