Target
Substance-P receptor
Ligand
BDBM50002652
Substrate
Meas. Tech.
ChEMBL_205895 (CHEMBL813807)
IC50
1905.46±n/a nM
Citation
 Takeuchi, YShands, EFBeusen, DDMarshall, GR Derivation of a three-dimensional pharmacophore model of substance P antagonists bound to the neurokinin-1 receptor. J Med Chem 41:3609-23 (1998)  
Target
Name:
Substance-P receptor
Synonyms:
NK-1 receptor NK1 Receptor NK1R_HUMAN Neurokinin-1 (NK-1) SPR TACR1 Tachykinin receptor 1 (NK1) | tachykinin
Type:
G Protein-Coupled Receptor (GPCR)
Mol. Mass.:
46254.43
Organism:
Homo sapiens (Human)
Description:
P25103
Residue:
407
  
Inhibitor
Name:
BDBM50002652
Synonyms:
((2S,3S)-2-Benzhydryl-1-aza-bicyclo[2.2.2]oct-3-yl)-(4-chloro-benzyl)-amine CHEMBL433336
Type:
Small organic molecule
Emp. Form.:
C27H29ClN2
Mol. Mass.:
416.986
SMILES:
Clc1ccc(CN[C@H]2C3CCN(CC3)[C@H]2C(c2ccccc2)c2ccccc2)cc1
: