Target
Substance-P receptor
Ligand
BDBM50029878
Substrate
Meas. Tech.
ChEMBL_205893 (CHEMBL813805)
IC50
0.708±n/a nM
Citation
 Takeuchi, YShands, EFBeusen, DDMarshall, GR Derivation of a three-dimensional pharmacophore model of substance P antagonists bound to the neurokinin-1 receptor. J Med Chem 41:3609-23 (1998)  
Target
Name:
Substance-P receptor
Synonyms:
NK-1 receptor NK1 Receptor NK1R_HUMAN Neurokinin-1 (NK-1) SPR TACR1 Tachykinin receptor 1 (NK1) | tachykinin
Type:
G Protein-Coupled Receptor (GPCR)
Mol. Mass.:
46254.43
Organism:
Homo sapiens (Human)
Description:
P25103
Residue:
407
  
Inhibitor
Name:
BDBM50029878
Synonyms:
(2R,3S)-2-Benzhydryl-3-(3,5-bis-trifluoromethyl-benzyloxy)-1-aza-bicyclo[2.2.2]octane | CHEMBL49638
Type:
Small organic molecule
Emp. Form.:
C29H27F6NO
Mol. Mass.:
519.5212
SMILES:
FC(F)(F)c1cc(CO[C@H]2C3CCN(CC3)[C@@H]2C(c2ccccc2)c2ccccc2)cc(c1)C(F)(F)F
: