Target
Cathepsin K
Ligand
BDBM50408520
Substrate
Meas. Tech.
ChEMBL_48330 (CHEMBL663319)
Ki
1±n/a nM
Citation
 Thompson, SKSmith, WWZhao, BHalbert, SMTomaszek, TATew, DGLevy, MAJanson, CADAlessio, KJMcQueney, MSKurdyla, JJones, CSDesJarlais, RLAbdel-Meguid, SSVeber, DF Structure-based design of cathepsin K inhibitors containing a benzyloxy-substituted benzoyl peptidomimetic. J Med Chem 41:3923-7 (1998)  
Target
Name:
Cathepsin K
Synonyms:
CATK_HUMAN CTSO Cathepsin O Cathepsin X
Type:
Enzyme
Mol. Mass.:
36975.68
Organism:
Homo sapiens (Human)
Description:
P43235
Residue:
329
  
Inhibitor
Name:
BDBM50408520
Synonyms:
CHEMBL126352
Type:
Small organic molecule
Emp. Form.:
C26H34N6O7
Mol. Mass.:
542.5842
SMILES:
CC(C)C[C@H](NC(=O)OCc1ccccc1)C(=O)NNC(=O)NNC(=O)[C@H](C)NC(=O)OCc1ccccc1
: