Target
Reverse transcriptase/RNaseH
Ligand
BDBM50408900
Substrate
Meas. Tech.
ChEMBL_42166 (CHEMBL655350)
EC50
7800±n/a nM
Citation
 Pontikis, RDollé, VGuillaumel, JDechaux, ENote, RNguyen, CHLegraverend, MBisagni, EAubertin, AMGrierson, DSMonneret, C Synthesis and evaluation of"AZT-HEPT","AZT-pyridinone", and"ddC-HEPT" conjugates as inhibitors of HIV reverse transcriptase. J Med Chem 43:1927-39 (2000)  
Target
Name:
Reverse transcriptase/RNaseH
Synonyms:
HIV-1 Reverse Transcriptase RNase H Reverse transcriptase/RNaseH
Type:
PROTEIN
Mol. Mass.:
65229.15
Organism:
Human immunodeficiency virus 1
Description:
ChEMBL_1473730
Residue:
566
  
Inhibitor
Name:
BDBM50408900
Synonyms:
CHEMBL417953
Type:
Small organic molecule
Emp. Form.:
C21H38N4O3
Mol. Mass.:
394.5514
SMILES:
NCCCCCCCCCCCCNc1ccn(C2CCC(CO)O2)c(=O)n1
: