Target
Vascular endothelial growth factor receptor 2
Ligand
BDBM17016
Substrate
Meas. Tech.
ChEMBL_213948 (CHEMBL811926)
IC50
30903±n/a nM
Citation
 Vieth, MCummins, DJ DoMCoSAR: a novel approach for establishing the docking mode that is consistent with the structure-activity relationship. Application to HIV-1 protease inhibitors and VEGF receptor tyrosine kinase inhibitors. J Med Chem 43:3020-32 (2000)  
Target
Name:
Vascular endothelial growth factor receptor 2
Synonyms:
Flk-1 Kdr VGFR2_MOUSE | Vascular endothelial growth factor receptor 2
Type:
PROTEIN
Mol. Mass.:
152506.58
Organism:
Mus musculus
Description:
ChEMBL_1469997
Residue:
1367
  
Inhibitor
Name:
BDBM17016
Synonyms:
(3Z)-4-methyl-3-(1H-pyrrol-2-ylmethylidene)-2,3-dihydro-1H-indol-2-one Indolinone based inhibitor, 1a
Type:
Small organic molecule
Emp. Form.:
C14H12N2O
Mol. Mass.:
224.2579
SMILES:
Cc1cccc2NC(=O)\C(=C/c3ccc[nH]3)c12
: