Target
Vascular endothelial growth factor receptor 2
Ligand
BDBM50111603
Substrate
Meas. Tech.
ChEMBL_213948 (CHEMBL811926)
IC50
794±n/a nM
Citation
 Vieth, MCummins, DJ DoMCoSAR: a novel approach for establishing the docking mode that is consistent with the structure-activity relationship. Application to HIV-1 protease inhibitors and VEGF receptor tyrosine kinase inhibitors. J Med Chem 43:3020-32 (2000)  
Target
Name:
Vascular endothelial growth factor receptor 2
Synonyms:
Flk-1 Kdr VGFR2_MOUSE | Vascular endothelial growth factor receptor 2
Type:
PROTEIN
Mol. Mass.:
152506.58
Organism:
Mus musculus
Description:
ChEMBL_1469997
Residue:
1367
  
Inhibitor
Name:
BDBM50111603
Synonyms:
3-(4-(dimethylamino)benzylidene)indolin-2-one 3-[1-(4-Dimethylamino-phenyl)-meth-(E)-ylidene]-1,3-dihydro-indol-2-one SU-4312 US9422297, DMBI
Type:
Small organic molecule
Emp. Form.:
C17H16N2O
Mol. Mass.:
264.3217
SMILES:
CN(C)c1ccc(\C=C2\C(=O)Nc3ccccc23)cc1
: