Target
Tubulin alpha-1A chain
Ligand
BDBM50409014
Substrate
Meas. Tech.
ChEMBL_212206 (CHEMBL817769)
IC50
446.68±n/a nM
Citation
 Zhang, SXFeng, JKuo, SCBrossi, AHamel, ETropsha, ALee, KH Antitumor agents. 199. Three-dimensional quantitative structure-activity relationship study of the colchicine binding site ligands using comparative molecular field analysis. J Med Chem 43:167-76 (2000)  
Target
Name:
Tubulin alpha-1A chain
Synonyms:
TBA1A_PIG Tubulin Tubulin alpha-1A chain
Type:
Protein
Mol. Mass.:
50049.25
Organism:
Sus scrofa (Pig)
Description:
P02550
Residue:
451
  
Inhibitor
Name:
BDBM50409014
Synonyms:
CHEMBL50139
Type:
Small organic molecule
Emp. Form.:
C23H15NO5
Mol. Mass.:
385.3689
SMILES:
Oc1cc(nc2cc3OCOc3cc12)-c1cccc(OC(=O)c2ccccc2)c1
: