Target
HLA class I histocompatibility antigen, A alpha chain
Ligand
BDBM50409414
Substrate
Meas. Tech.
ChEMBL_47858 (CHEMBL660105)
IC50
3.2±n/a nM
Citation
 Doytchinova, IAFlower, DR Toward the quantitative prediction of T-cell epitopes: coMFA and coMSIA studies of peptides with affinity for the class I MHC molecule HLA-A*0201. J Med Chem 44:3572-81 (2001)  
Target
Name:
HLA class I histocompatibility antigen, A alpha chain
Synonyms:
HLA class I histocompatibility antigen A-3 HLA-A HLAA_HUMAN | MHC class I antigen A*3
Type:
PROTEIN
Mol. Mass.:
40836.72
Organism:
Homo sapiens (Human)
Description:
ChEMBL_47858
Residue:
365
  
Inhibitor
Name:
BDBM50409414
Synonyms:
CHEMBL386178
Type:
Small organic molecule
Emp. Form.:
C48H69N9O12
Mol. Mass.:
964.1146
SMILES:
CC(C)C[C@H](NC(=O)[C@@H](N)Cc1ccc(O)cc1)C(=O)N[C@@H](Cc1ccccc1)C(=O)N1CCC[C@H]1C(=O)NCC(=O)N1CCC[C@H]1C(=O)N[C@@H](C(C)C)C(=O)N[C@@H]([C@@H](C)O)C(=O)N[C@@H](C)C(O)=O
: