Target
T-cell surface glycoprotein CD4
Ligand
BDBM50093813
Substrate
Meas. Tech.
ChEMBL_101473 (CHEMBL712351)
EC50
>125000±n/a nM
Citation
 Santhosh, KCPaul, GCDe Clercq, EPannecouque, CWitvrouw, MLoftus, TLTurpin, JABuckheit, RWCushman, M Correlation of anti-HIV activity with anion spacing in a series of cosalane analogues with extended polycarboxylate pharmacophores. J Med Chem 44:703-14 (2001)  
Target
Name:
T-cell surface glycoprotein CD4
Synonyms:
CD4 CD_antigen=CD4 T-cell surface antigen T4/Leu-3 | T-cell surface glycoprotein CD4
Type:
PROTEIN
Mol. Mass.:
51136.66
Organism:
Homo sapiens (Human)
Description:
ChEMBL_440402
Residue:
458
  
Inhibitor
Name:
BDBM50093813
Synonyms:
(5-{1-[3-(Carboxymethyl-carbamoyl)-5-chloro-4-hydroxy-phenyl]-4-[(3S,10S,13R,17R)-17-(1,5-dimethyl-hexyl)-10,13-dimethyl-hexadecahydro-cyclopenta[a]phenanthren-3-yl]-butyl}-3-chloro-2-hydroxy-benzoylamino)-acetic acid CHEMBL85528
Type:
Small organic molecule
Emp. Form.:
C49H68Cl2N2O8
Mol. Mass.:
883.979
SMILES:
CC(C)CCCC(C)[C@H]1CCC2C3CCC4C[C@@H](CCCC(c5cc(Cl)c(O)c(c5)C(=O)NCC(O)=O)c5cc(Cl)c(O)c(c5)C(=O)NCC(O)=O)CC[C@]4(C)C3CC[C@]12C
: