Target
Beta-2 adrenergic receptor
Ligand
BDBM50409469
Substrate
Meas. Tech.
ChEMBL_218263 (CHEMBL819428)
IC50
1288.25±n/a nM
Citation
 Tanaka, NTamai, TMukaiyama, HHirabayashi, AMuranaka, HAkahane, SMiyata, HAkahane, M Discovery of novel N-phenylglycine derivatives as potent and selective beta(3)-adrenoceptor agonists for the treatment of frequent urination and urinary incontinence. J Med Chem 44:1436-45 (2001)  
Target
Name:
Beta-2 adrenergic receptor
Synonyms:
ADRB2_RAT Adrb2r | Adrenergic receptor beta
Type:
PROTEIN
Mol. Mass.:
46896.26
Organism:
Rattus norvegicus
Description:
ChEMBL_38603
Residue:
418
  
Inhibitor
Name:
BDBM50409469
Synonyms:
CHEMBL284520
Type:
Small organic molecule
Emp. Form.:
C19H22Cl2N2O4
Mol. Mass.:
413.295
SMILES:
C[C@H](NCCc1cc(Cl)c(NCC(O)=O)cc1Cl)[C@H](O)c1ccc(O)cc1
: