Target
ATP synthase subunit gamma, mitochondrial
Ligand
BDBM50409908
Substrate
Meas. Tech.
ChEMBL_65923 (CHEMBL678318)
IC50
>100000±n/a nM
Citation
 Atwal, KSWang, PRogers, WLSleph, PMonshizadegan, HFerrara, FNTraeger, SGreen, DWGrover, GJ Small molecule mitochondrial F1F0 ATPase hydrolase inhibitors as cardioprotective agents. Identification of 4-(N-arylimidazole)-substituted benzopyran derivatives as selective hydrolase inhibitors. J Med Chem 47:1081-4 (2004)  
Target
Name:
ATP synthase subunit gamma, mitochondrial
Synonyms:
ATP5C ATP5F1C F-ATPase gamma subunit
Type:
PROTEIN
Mol. Mass.:
33081.70
Organism:
Bos taurus
Description:
ChEMBL_65923
Residue:
298
  
Inhibitor
Name:
BDBM50409908
Synonyms:
CHEMBL11802
Type:
Small organic molecule
Emp. Form.:
C20H18ClN5O2
Mol. Mass.:
395.842
SMILES:
CC1(C)Oc2ccc(cc2[C@H](N=C(NC#N)Nc2ccc(Cl)cc2)[C@H]1O)C#N
: