Target
ATP synthase subunit beta,/delta,/epsilon,/gamma, mitochondrial
Ligand
BDBM50010132
Substrate
Meas. Tech.
ChEMBL_65923 (CHEMBL678318)
IC50
>100000±n/a nM
Citation
 Atwal, KSWang, PRogers, WLSleph, PMonshizadegan, HFerrara, FNTraeger, SGreen, DWGrover, GJ Small molecule mitochondrial F1F0 ATPase hydrolase inhibitors as cardioprotective agents. Identification of 4-(N-arylimidazole)-substituted benzopyran derivatives as selective hydrolase inhibitors. J Med Chem 47:1081-4 (2004)  
Target
Name:
ATP synthase subunit beta,/delta,/epsilon,/gamma, mitochondrial
Synonyms:
Mitochondrial complex V; ATP synthase
Type:
Mol. Mass.:
Description:
ASSAY_ID of EBI is 65924
Components:
This complex has 4 components.
Component 1
Name:
ATP synthase subunit epsilon, mitochondrial
Synonyms:
ATP5E ATP5F1E | ATPase subunit epsilon
Type:
PROTEIN
Mol. Mass.:
5790.87
Organism:
Bos taurus
Description:
EBI_100264
Residue:
51
  
Component 2
Name:
ATP synthase subunit beta, mitochondrial
Synonyms:
ATP5B ATPB_BOVIN
Type:
PROTEIN
Mol. Mass.:
56271.25
Organism:
Bos taurus
Description:
EBI_100264
Residue:
528
  
Component 3
Name:
ATP synthase subunit gamma, mitochondrial
Synonyms:
ATP5C ATP5F1C F-ATPase gamma subunit
Type:
PROTEIN
Mol. Mass.:
33081.70
Organism:
Bos taurus
Description:
ChEMBL_65923
Residue:
298
  
Component 4
Name:
ATP synthase subunit delta, mitochondrial
Synonyms:
ATP5D ATPD_BOVIN | F-ATPase delta subunit
Type:
PROTEIN
Mol. Mass.:
17608.84
Organism:
Bos taurus
Description:
EBI_100264
Residue:
168
  
Inhibitor
Name:
BDBM50010132
Synonyms:
(3S,4R)-3-Hydroxy-2,2-dimethyl-4-(2-oxo-pyrrolidin-1-yl)-chroman-6-carbonitrile 3-Hydroxy-2,2-dimethyl-4-(2-oxo-pyrrolidin-1-yl)-chroman-6-carbonitrile 3-Hydroxy-2,2-dimethyl-4-(2-oxo-pyrrolidin-1-yl)-chroman-6-carbonitrile(BRL 38227) BRL-38227 Levcromakalim
Type:
Small organic molecule
Emp. Form.:
C16H18N2O3
Mol. Mass.:
286.3257
SMILES:
CC1(C)Oc2ccc(cc2[C@H]([C@@H]1O)N1CCCC1=O)C#N
: