Target
Gonadotropin-releasing hormone receptor
Ligand
BDBM50001567
Substrate
Meas. Tech.
ChEMBL_100148 (CHEMBL712505)
Ki
794±n/a nM
Citation
 Randolph, JTWaid, PNichols, CSauer, DHaviv, FDiaz, GBammert, GBesecke, LMSegreti, JAMohning, KMBush, ENWegner, CDGreer, J Nonpeptide luteinizing hormone-releasing hormone antagonists derived from erythromycin A: design, synthesis, and biological activity of cladinose replacement analogues. J Med Chem 47:1085-97 (2004)  
Target
Name:
Gonadotropin-releasing hormone receptor
Synonyms:
GNRHR GRHR GnRH-R Gonadotropin-releasing hormone receptor | Gonadotropin-releasing hormone receptor (GnRH)
Type:
Enzyme
Mol. Mass.:
37749.45
Organism:
Homo sapiens (Human)
Description:
P30968
Residue:
328
  
Inhibitor
Name:
BDBM50001567
Synonyms:
CHEMBL275521
Type:
Small organic molecule
Emp. Form.:
C46H72ClN3O12
Mol. Mass.:
894.53
SMILES:
[H][C@@]12[C@@H](C)C(=O)[C@H](C)C[C@](C)(OC)[C@H](OC3O[C@H](C)C[C@@H]([C@H]3O)N(C)C(C)C)[C@@H](C)[C@H](OC(=O)N3CCOC3C)[C@@H](C)C(=O)O[C@H](CC)[C@@]1(C)OC(=O)N2CCc1ccc(Cl)cc1
: