Target
Potassium voltage-gated channel subfamily H member 2
Ligand
BDBM25759
Substrate
Meas. Tech.
ChEMBL_307245 (CHEMBL829152)
IC50
10471.29±n/a nM
Citation
 Tobita, MNishikawa, TNagashima, R A discriminant model constructed by the support vector machine method for HERG potassium channel inhibitors. Bioorg Med Chem Lett 15:2886-90 (2005)  
Target
Name:
Potassium voltage-gated channel subfamily H member 2
Synonyms:
1,3-beta-glucan synthase component GLS2 ERG Eag-related protein 1 Ether-a-go-go-related gene (HERG) Ether-a-go-go-related gene potassium channel 1 Ether-a-go-go-related gene potassium channel 1 (hERG1) Ether-a-go-go-related protein 1 H-ERG KCNH2 Potassium voltage-gated channel subfamily H member 2 (hERG) Voltage-gated potassium channel subunit Kv11.1 hERG Potassium Channel 1 | putative potassium channel subunit
Type:
Multi-pass membrane protein
Mol. Mass.:
126672.65
Organism:
Homo sapiens (Human)
Description:
Q12809
Residue:
1159
  
Inhibitor
Name:
BDBM25759
Synonyms:
CHEMBL723 Coreg Eucardic | [3-(9H-carbazol-4-yloxy)-2-hydroxypropyl][2-(2-methoxyphenoxy)ethyl]amine
Type:
Small organic molecule
Emp. Form.:
C24H26N2O4
Mol. Mass.:
406.4742
SMILES:
COc1ccccc1OCCNCC(O)COc1cccc2[nH]c3ccccc3c12
: