Target
Histamine H3 receptor
Ligand
BDBM50410326
Substrate
Meas. Tech.
ChEMBL_304030 (CHEMBL840208)
Ki
1±n/a nM
Citation
 Dvorak, CAApodaca, RBarbier, AJBerridge, CWWilson, SJBoggs, JDXiao, WLovenberg, TWCarruthers, NI 4-phenoxypiperidines: potent, conformationally restricted, non-imidazole histamine H3 antagonists. J Med Chem 48:2229-38 (2005)  
Target
Name:
Histamine H3 receptor
Synonyms:
G-protein coupled receptor 97 HH3R HRH3 Histamine H3 receptor (H3) Histamine receptor (H3 and H4)
Type:
G Protein-Coupled Receptor (GPCR)
Mol. Mass.:
48691.47
Organism:
Homo sapiens (Human)
Description:
Binding assays were using CHO cells stably expressing hH3R receptors.
Residue:
445
  
Inhibitor
Name:
BDBM50410326
Synonyms:
CHEMBL194541
Type:
Small organic molecule
Emp. Form.:
C21H34N2O2
Mol. Mass.:
346.5069
SMILES:
CC(C)N1CCC(CC1)Oc1ccc(CN2CCC(CO)CC2)cc1
: