Target
Adenosine receptor A2b
Ligand
BDBM50410667
Substrate
Meas. Tech.
ChEMBL_330270 (CHEMBL862098)
Ki
3.47±n/a nM
Citation
 Carotti, ACadavid, MICenteno, NBEsteve, CLoza, MIMartinez, ANieto, RRaviña, ESanz, FSegarra, VSotelo, EStefanachi, AVidal, B Design, synthesis, and structure-activity relationships of 1-,3-,8-, and 9-substituted-9-deazaxanthines at the human A2B adenosine receptor. J Med Chem 49:282-99 (2006)  
Target
Name:
Adenosine receptor A2b
Synonyms:
AA2BR_HUMAN ADORA2B Adenosine receptors A2b | Adenosine receptors; A2a & A2b
Type:
G Protein-Coupled Receptor (GPCR)
Mol. Mass.:
36341.22
Organism:
Homo sapiens (Human)
Description:
Residue:
332
  
Inhibitor
Name:
BDBM50410667
Synonyms:
CHEMBL201750
Type:
Small organic molecule
Emp. Form.:
C23H21BrN4O5
Mol. Mass.:
513.341
SMILES:
COc1cc(OCC(=O)Nc2ccc(Br)cc2)ccc1-c1cc2n(C)c(=O)n(C)c(=O)c2[nH]1
: