Target
Adenosine receptor A2a
Ligand
BDBM50410646
Substrate
Meas. Tech.
ChEMBL_330271 (CHEMBL862097)
Ki
1230.27±n/a nM
Citation
 Carotti, ACadavid, MICenteno, NBEsteve, CLoza, MIMartinez, ANieto, RRaviña, ESanz, FSegarra, VSotelo, EStefanachi, AVidal, B Design, synthesis, and structure-activity relationships of 1-,3-,8-, and 9-substituted-9-deazaxanthines at the human A2B adenosine receptor. J Med Chem 49:282-99 (2006)  
Target
Name:
Adenosine receptor A2a
Synonyms:
A2A adenosine receptor (hA2A) ADENOSINE A2 ADORA2 Adenosine A2A receptor (A2AAR)
Type:
G Protein-Coupled Receptor (GPCR)
Mol. Mass.:
44716.46
Organism:
Homo sapiens (Human)
Description:
P29274
Residue:
412
  
Inhibitor
Name:
BDBM50410646
Synonyms:
CHEMBL370378
Type:
Small organic molecule
Emp. Form.:
C22H19BrN4O4
Mol. Mass.:
483.315
SMILES:
Cn1c2cc([nH]c2c(=O)n(C)c1=O)-c1ccc(OCC(=O)Nc2ccc(Br)cc2)cc1
: