Target
Histidine-rich protein PFHRP-II
Ligand
BDBM22985
Substrate
Meas. Tech.
ChEMBL_377021 (CHEMBL854475)
IC50
46300±n/a nM
Citation
 Biot, CDaher, WNdiaye, CMMelnyk, PPradines, BChavain, NPellet, AFraisse, LPelinski, LJarry, CBrocard, JKhalife, JForfar-Bares, IDive, D Probing the role of the covalent linkage of ferrocene into a chloroquine template. J Med Chem 49:4707-14 (2006)  
Target
Name:
Histidine-rich protein PFHRP-II
Synonyms:
HRP1_PLAFA Histidine-rich protein PFHRP-II
Type:
PROTEIN
Mol. Mass.:
35156.49
Organism:
Plasmodium falciparum
Description:
ChEMBL_500704
Residue:
332
  
Inhibitor
Name:
BDBM22985
Synonyms:
Aralen CHLOROQUINE PHOSPHATE Chloroquine med.21724, Compound 8 | {4-[(7-chloroquinolin-4-yl)amino]pentyl}diethylamine
Type:
Antimalarial
Emp. Form.:
C18H26ClN3
Mol. Mass.:
319.872
SMILES:
CCN(CC)CCCC(C)Nc1ccnc2cc(Cl)ccc12
: