Target
Alpha-1A adrenergic receptor
Ligand
BDBM50392637
Substrate
Meas. Tech.
ChEMBL_412940 (CHEMBL910638)
Ki
0.41±n/a nM
Citation
 Pallavicini, MBudriesi, RFumagalli, LIoan, PChiarini, ABolchi, CUgenti, MPColleoni, SGobbi, MValoti, E WB4101-related compounds: new, subtype-selective alpha1-adrenoreceptor antagonists (or inverse agonists?). J Med Chem 49:7140-9 (2006)  
Target
Name:
Alpha-1A adrenergic receptor
Synonyms:
ADA1A_HUMAN ADRA1C Alpha 1A-adrenoceptor Alpha adrenergic receptor 1a Alpha-adrenergic receptor 1c adrenergic Alpha1 | adrenergic Alpha1C
Type:
Cell-surface receptors
Mol. Mass.:
51511.67
Organism:
Homo sapiens (Human)
Description:
P35348
Residue:
466
  
Inhibitor
Name:
BDBM50392637
Synonyms:
CHEMBL215421
Type:
Small organic molecule
Emp. Form.:
C19H23NO5
Mol. Mass.:
345.3896
SMILES:
COc1cccc(OC)c1OCCNC[C@H]1COc2ccccc2O1
: