Target
Alpha-1B adrenergic receptor
Ligand
BDBM50411191
Substrate
Meas. Tech.
ChEMBL_412941 (CHEMBL910640)
Ki
186±n/a nM
Citation
 Pallavicini, MBudriesi, RFumagalli, LIoan, PChiarini, ABolchi, CUgenti, MPColleoni, SGobbi, MValoti, E WB4101-related compounds: new, subtype-selective alpha1-adrenoreceptor antagonists (or inverse agonists?). J Med Chem 49:7140-9 (2006)  
Target
Name:
Alpha-1B adrenergic receptor
Synonyms:
ADA1B_HUMAN Adrenergic alpha1B Adrenergic receptor alpha Alpha 1B-adrenoreceptor | Alpha-1B adrenergic receptor
Type:
Enzyme
Mol. Mass.:
56862.13
Organism:
Homo sapiens (Human)
Description:
P35368
Residue:
520
  
Inhibitor
Name:
BDBM50411191
Synonyms:
CHEMBL214762
Type:
Small organic molecule
Emp. Form.:
C24H25NO4
Mol. Mass.:
391.4596
SMILES:
COc1cc(ccc1OCCNC[C@H]1COc2ccccc2O1)-c1ccccc1
: