Target
5-hydroxytryptamine receptor 1A
Ligand
BDBM50002730
Substrate
Meas. Tech.
ChEMBL_412943 (CHEMBL910643)
Ki
1000±n/a nM
Citation
 Pallavicini, MBudriesi, RFumagalli, LIoan, PChiarini, ABolchi, CUgenti, MPColleoni, SGobbi, MValoti, E WB4101-related compounds: new, subtype-selective alpha1-adrenoreceptor antagonists (or inverse agonists?). J Med Chem 49:7140-9 (2006)  
Target
Name:
5-hydroxytryptamine receptor 1A
Synonyms:
5-HT-1A 5-HT1A 5-hydroxytryptamine receptor 1A (5HT1A) 5ht1a Htr1a Serotonin 1a (5-HT1a) receptor/Adrenergic receptor alpha-1 | Serotonin receptor 1A
Type:
G Protein-Coupled Receptor (GPCR)
Mol. Mass.:
46445.29
Organism:
Rattus norvegicus (rat)
Description:
Binding assays were performed using rat hippocampal membranes.
Residue:
422
  
Inhibitor
Name:
BDBM50002730
Synonyms:
CHEMBL436955
Type:
Small organic molecule
Emp. Form.:
C23H26ClNO5
Mol. Mass.:
431.909
SMILES:
Cl.COc1cccc(OC)c1OCCNC[C@@H]1COc2cc3ccccc3cc2O1
: