Target
Alpha-1D adrenergic receptor
Ligand
BDBM50411194
Substrate
Meas. Tech.
ChEMBL_412942 (CHEMBL910642)
Ki
14±n/a nM
Citation
 Pallavicini, MBudriesi, RFumagalli, LIoan, PChiarini, ABolchi, CUgenti, MPColleoni, SGobbi, MValoti, E WB4101-related compounds: new, subtype-selective alpha1-adrenoreceptor antagonists (or inverse agonists?). J Med Chem 49:7140-9 (2006)  
Target
Name:
Alpha-1D adrenergic receptor
Synonyms:
ADA1D_HUMAN ADRA1D Adrenergic receptor alpha Alpha 1D-adrenoreceptor Alpha-1D adrenoceptor adrenergic Alpha1D
Type:
Enzyme Catalytic Domain
Mol. Mass.:
60485.82
Organism:
Homo sapiens (Human)
Description:
adrenergic Alpha1D ADRA1D HUMAN::P25100
Residue:
572
  
Inhibitor
Name:
BDBM50411194
Synonyms:
CHEMBL383938
Type:
Small organic molecule
Emp. Form.:
C22H27NO4
Mol. Mass.:
369.4541
SMILES:
COc1ccc2CCCCc2c1OCCNC[C@H]1COc2ccccc2O1
: