Target
7-dehydrocholesterol reductase
Ligand
BDBM50411320
Substrate
Meas. Tech.
ChEMBL_430046 (CHEMBL644842)
IC50
60±n/a nM
Citation
 Burke, PJKalet, BTKoch, TH Antiestrogen binding site and estrogen receptor mediate uptake and distribution of 4-hydroxytamoxifen-targeted doxorubicin-formaldehyde conjugate in breast cancer cells. J Med Chem 47:6509-18 (2004)  
Target
Name:
7-dehydrocholesterol reductase
Synonyms:
7-DHC reductase Anti-estrogen binding site (AEBS) DHCR7 Putative sterol reductase SR-2 | Sterol Delta(7)-reductase
Type:
PROTEIN
Mol. Mass.:
54508.42
Organism:
Homo sapiens (Human)
Description:
ChEMBL_864350
Residue:
475
  
Inhibitor
Name:
BDBM50411320
Synonyms:
CHEMBL222694
Type:
Small organic molecule
Emp. Form.:
C67H74N4O18
Mol. Mass.:
1223.3205
SMILES:
CC\C(=C(\c1ccc(O)cc1)c1ccc(OCCN(C)CCOCCOCCO\N=C\c2ccc(O)c(c2)C(=O)NCN[C@H]2C[C@H](O[C@H]3C[C@@](O)(Cc4c(O)c5C(=O)c6cccc(OC)c6C(=O)c5c(O)c34)C(=O)CO)O[C@@H](C)[C@H]2O)cc1)c1ccccc1
: