Target
7-dehydrocholesterol reductase
Ligand
BDBM50411319
Substrate
Meas. Tech.
ChEMBL_430045 (CHEMBL918647)
IC50
70±n/a nM
Citation
 Burke, PJKalet, BTKoch, TH Antiestrogen binding site and estrogen receptor mediate uptake and distribution of 4-hydroxytamoxifen-targeted doxorubicin-formaldehyde conjugate in breast cancer cells. J Med Chem 47:6509-18 (2004)  
Target
Name:
7-dehydrocholesterol reductase
Synonyms:
7-DHC reductase Anti-estrogen binding site (AEBS) DHCR7 Putative sterol reductase SR-2 | Sterol Delta(7)-reductase
Type:
PROTEIN
Mol. Mass.:
54508.42
Organism:
Homo sapiens (Human)
Description:
ChEMBL_864350
Residue:
475
  
Inhibitor
Name:
BDBM50411319
Synonyms:
CHEMBL266892
Type:
Small organic molecule
Emp. Form.:
C35H36N2O13
Mol. Mass.:
692.6659
SMILES:
COc1cccc2C(=O)c3c(O)c4C[C@](O)(C[C@H](O[C@H]5C[C@H](NCNC(=O)c6ccccc6O)[C@H](O)[C@H](C)O5)c4c(O)c3C(=O)c12)C(=O)CO
: