Target
Thyroid hormone receptor beta
Ligand
BDBM50123058
Substrate
Meas. Tech.
ChEMBL_447974 (CHEMBL898226)
IC50
0.0562±n/a nM
Citation
 Liu, HGramatica, P QSAR study of selective ligands for the thyroid hormone receptor beta. Bioorg Med Chem 15:5251-61 (2007)  
Target
Name:
Thyroid hormone receptor beta
Synonyms:
ERBA2 Nuclear receptor subfamily 1 group A member 2 THR1 c-erbA-2 | c-erbA-beta
Type:
Receptor
Mol. Mass.:
52793.62
Organism:
Homo sapiens (Human)
Description:
Recombinant hThR was obtained from nuclear extracts from SF9 cells infected with baculovirus vectors encoding for ThRbeta 1.
Residue:
461
  
Inhibitor
Name:
BDBM50123058
Synonyms:
2-(3,5-dichloro-4-(4-hydroxy-3-(piperidin-1-ylsulfonyl)phenoxy)phenyl)-1,2,4-triazine-3,5(2H,4H)-dione CHEMBL124126
Type:
Small organic molecule
Emp. Form.:
C20H18Cl2N4O6S
Mol. Mass.:
513.351
SMILES:
Oc1ccc(Oc2c(Cl)cc(cc2Cl)-n2ncc(=O)[nH]c2=O)cc1S(=O)(=O)N1CCCCC1
: