Target
Thyroid hormone receptor beta
Ligand
BDBM18863
Substrate
Meas. Tech.
ChEMBL_447974 (CHEMBL898226)
IC50
0.11±n/a nM
Citation
 Liu, HGramatica, P QSAR study of selective ligands for the thyroid hormone receptor beta. Bioorg Med Chem 15:5251-61 (2007)  
Target
Name:
Thyroid hormone receptor beta
Synonyms:
ERBA2 Nuclear receptor subfamily 1 group A member 2 THR1 c-erbA-2 | c-erbA-beta
Type:
Receptor
Mol. Mass.:
52793.62
Organism:
Homo sapiens (Human)
Description:
Recombinant hThR was obtained from nuclear extracts from SF9 cells infected with baculovirus vectors encoding for ThRbeta 1.
Residue:
461
  
Inhibitor
Name:
BDBM18863
Synonyms:
(2R)-2-amino-3-{4-[4-hydroxy-3-(propan-2-yl)phenoxy]-3,5-diiodophenyl}propanoic acid | diiodo isopropyl thyronine, 4
Type:
Small organic molecule
Emp. Form.:
C18H19I2NO4
Mol. Mass.:
567.1567
SMILES:
CC(C)c1cc(Oc2c(I)cc(C[C@@H](N)C(O)=O)cc2I)ccc1O
: