Target
Neuronal acetylcholine receptor subunit alpha-4/beta-2
Ligand
BDBM50079453
Substrate
Meas. Tech.
ChEMBL_452154 (CHEMBL901310)
Ki
0.038±n/a nM
Citation
 Carroll, FIRobinson, TPBrieaddy, LEAtkinson, RNMascarella, SWDamaj, MIMartin, BRNavarro, HA Synthesis and nicotinic acetylcholine receptor binding properties of bridged and fused ring analogues of epibatidine. J Med Chem 50:6383-91 (2007)  
Target
Name:
Neuronal acetylcholine receptor subunit alpha-4/beta-2
Synonyms:
Neuronal acetylcholine receptor Alpha-4/Beta-2 Neuronal acetylcholine receptor; alpha4/beta2 | nAChR subtypes alpha4 beta2
Type:
Protein
Mol. Mass.:
Description:
Components:
This complex has 2 components.
Component 1
Name:
Neuronal acetylcholine receptor subunit alpha-4
Synonyms:
ACHA4_HUMAN CHRNA4 protein Neuronal acetylcholine receptor protein alpha-4 subunit Nicotinic acetylcholine receptor alpha4/beta2/alpha5
Type:
Mol. Mass.:
69963.49
Organism:
Homo sapiens (Human)
Description:
NACHRA4
Residue:
627
  
Component 2
Name:
Neuronal acetylcholine receptor subunit beta-2
Synonyms:
ACHB2_HUMAN Neuronal acetylcholine receptor protein beta-2 subunit | Nicotinic acetylcholine receptor alpha3/beta2/alpha5
Type:
Protein
Mol. Mass.:
57020.50
Organism:
Homo sapiens (Human)
Description:
P17787
Residue:
502
  
Inhibitor
Name:
BDBM50079453
Synonyms:
2-(6-Chloro-pyridin-3-yl)-7-methyl-7-aza-bicyclo[2.2.1]heptane CMI-489 | N-methylepibatidine
Type:
Small organic molecule
Emp. Form.:
C12H15ClN2
Mol. Mass.:
222.714
SMILES:
CN1C2CCC1C(C2)c1ccc(Cl)nc1
: