Target
Carboxypeptidase A1
Ligand
BDBM50286724
Substrate
Meas. Tech.
ChEMBL_465247 (CHEMBL932068)
Ki
310±n/a nM
Citation
 Deaton, DNGao, ENGraham, KPGross, JWMiller, ABStrelow, JM Thiol-based angiotensin-converting enzyme 2 inhibitors: P1 modifications for the exploration of the S1 subsite. Bioorg Med Chem Lett 18:732-7 (2008)  
Target
Name:
Carboxypeptidase A1
Synonyms:
CBPA1_HUMAN CPA1
Type:
PROTEIN
Mol. Mass.:
47132.61
Organism:
Homo sapiens (Human)
Description:
ChEMBL_1496378
Residue:
419
  
Inhibitor
Name:
BDBM50286724
Synonyms:
(S)-3-Biphenyl-4-yl-2-((R)-2-mercapto-3-phenyl-propionylamino)-propionic acid | CHEMBL163454
Type:
Small organic molecule
Emp. Form.:
C24H23NO3S
Mol. Mass.:
405.509
SMILES:
OC(=O)[C@H](Cc1ccc(cc1)-c1ccccc1)NC(=O)[C@H](S)Cc1ccccc1
: