Target
Neprilysin
Ligand
BDBM50411733
Substrate
Meas. Tech.
ChEMBL_465246 (CHEMBL933040)
Ki
13±n/a nM
Citation
 Deaton, DNGao, ENGraham, KPGross, JWMiller, ABStrelow, JM Thiol-based angiotensin-converting enzyme 2 inhibitors: P1 modifications for the exploration of the S1 subsite. Bioorg Med Chem Lett 18:732-7 (2008)  
Target
Name:
Neprilysin
Synonyms:
Atriopeptidase CD_antigen=CD10 EPN MME NEP_HUMAN Neutral endopeptidase | Neutral endopeptidase 24.11
Type:
Enzyme
Mol. Mass.:
85505.38
Organism:
Homo sapiens (Human)
Description:
P08473
Residue:
750
  
Inhibitor
Name:
BDBM50411733
Synonyms:
CHEMBL269997
Type:
Small organic molecule
Emp. Form.:
C20H23NO3S
Mol. Mass.:
357.467
SMILES:
CC(C)[C@H](S)C(=O)N[C@@H](Cc1ccc(cc1)-c1ccccc1)C(O)=O
: