Target
7-dehydrocholesterol reductase
Ligand
BDBM50412076
Substrate
Meas. Tech.
ChEMBL_550766 (CHEMBL1008660)
IC50
2800±n/a nM
Citation
 Chang, LCBhat, KPPisha, EKennelly, EJFong, HHPezzuto, JMKinghorn, AD Activity-guided isolation of steroidal alkaloid antiestrogen-binding site inhibitors from Pachysandra procumbens. J Nat Prod 61:1257-62 (1998)  
Target
Name:
7-dehydrocholesterol reductase
Synonyms:
7-DHC reductase Anti-estrogen binding site (AEBS) DHCR7 Putative sterol reductase SR-2 | Sterol Delta(7)-reductase
Type:
PROTEIN
Mol. Mass.:
54508.42
Organism:
Homo sapiens (Human)
Description:
ChEMBL_864350
Residue:
475
  
Inhibitor
Name:
BDBM50412076
Synonyms:
CHEMBL457817
Type:
Small organic molecule
Emp. Form.:
C29H46N2O2
Mol. Mass.:
454.6877
SMILES:
CC(C)[C@@H]1CN(C1=O)C1=CC[C@]2(C)[C@H]3CC[C@]4(C)[C@H](CC[C@H]4[C@@H]3CC[C@H]2C1=O)[C@H](C)N(C)C
: