Target
7-dehydrocholesterol reductase
Ligand
BDBM50412077
Substrate
Meas. Tech.
ChEMBL_550766 (CHEMBL1008660)
IC50
600±n/a nM
Citation
 Chang, LCBhat, KPPisha, EKennelly, EJFong, HHPezzuto, JMKinghorn, AD Activity-guided isolation of steroidal alkaloid antiestrogen-binding site inhibitors from Pachysandra procumbens. J Nat Prod 61:1257-62 (1998)  
Target
Name:
7-dehydrocholesterol reductase
Synonyms:
7-DHC reductase Anti-estrogen binding site (AEBS) DHCR7 Putative sterol reductase SR-2 | Sterol Delta(7)-reductase
Type:
PROTEIN
Mol. Mass.:
54508.42
Organism:
Homo sapiens (Human)
Description:
ChEMBL_864350
Residue:
475
  
Inhibitor
Name:
BDBM50412077
Synonyms:
(+)-PACHYSAMINE B
Type:
Small organic molecule
Emp. Form.:
C29H50N2O
Mol. Mass.:
442.7201
SMILES:
[#6]-[#6@@H](-[#6@H]1-[#6]-[#6]-[#6@H]2-[#6@@H]-3-[#6]-[#6]-[#6@H]4-[#6]-[#6@@H](-[#6]-[#6][C@]4([#6])[#6@H]-3-[#6]-[#6][C@]12[#6])-[#7](-[#6])-[#6](=O)\[#6]=[#6](\[#6])-[#6])-[#7](-[#6])-[#6]
: