Target
Muscarinic acetylcholine receptor M4
Ligand
BDBM50412178
Substrate
Meas. Tech.
ChEMBL_556680 (CHEMBL958967)
Ki
407.38±n/a nM
Citation
 Dei, SBellucci, CBuccioni, MFerraroni, MGuandalini, LManetti, DMarucci, GMatucci, RNesi, MRomanelli, MNScapecchi, STeodori, E Muscarinic antagonists with multiple stereocenters: Synthesis, affinity profile and functional activity of isomeric 1-methyl-2-(2,2-alkylaryl-1,3-oxathiolan-5-yl)pyrrolidine sulfoxide derivatives. Bioorg Med Chem 16:5490-500 (2008)  
Target
Name:
Muscarinic acetylcholine receptor M4
Synonyms:
ACM4_HUMAN Cholinergic, muscarinic M4 Muscarinic acetylcholine receptor M2 and M4
Type:
Enzyme Catalytic Domain
Mol. Mass.:
53079.31
Organism:
Homo sapiens (Human)
Description:
Cholinergic, muscarinic M4 CHRM4 HUMAN M3::P08173
Residue:
479
  
Inhibitor
Name:
BDBM50412178
Synonyms:
CHEMBL493795
Type:
Small organic molecule
Emp. Form.:
C20H23NO2S
Mol. Mass.:
341.467
SMILES:
CN1CCC[C@H]1[C@H]1CS(=O)C(O1)(c1ccccc1)c1ccccc1
: