Target
Muscarinic acetylcholine receptor M1
Ligand
BDBM50412173
Substrate
Meas. Tech.
ChEMBL_556677 (CHEMBL958964)
Ki
38.02±n/a nM
Citation
 Dei, SBellucci, CBuccioni, MFerraroni, MGuandalini, LManetti, DMarucci, GMatucci, RNesi, MRomanelli, MNScapecchi, STeodori, E Muscarinic antagonists with multiple stereocenters: Synthesis, affinity profile and functional activity of isomeric 1-methyl-2-(2,2-alkylaryl-1,3-oxathiolan-5-yl)pyrrolidine sulfoxide derivatives. Bioorg Med Chem 16:5490-500 (2008)  
Target
Name:
Muscarinic acetylcholine receptor M1
Synonyms:
ACM1_HUMAN Cholinergic receptor, muscarinic 1 | Cholinergic, muscarinic M1
Type:
Protein
Mol. Mass.:
51442.54
Organism:
Homo sapiens (Human)
Description:
P11229
Residue:
460
  
Inhibitor
Name:
BDBM50412173
Synonyms:
CHEMBL496915
Type:
Small organic molecule
Emp. Form.:
C20H29NO2S
Mol. Mass.:
347.515
SMILES:
CN1CCC[C@@H]1[C@@H]1CS(=O)[C@](O1)(C1CCCCC1)c1ccccc1
: